------------------------ NotAnAgentClass TEST START ---------------------
[Fatal Error] :1:1: Contenu non autorisé dans le prologue.
[Fatal Error] :1:1: Contenu non autorisé dans le prologue.
[Fatal Error] :1:1: Contenu non autorisé dans le prologue.
[Fatal Error] :1:1: Contenu non autorisé dans le prologue.
[Fatal Error] :1:1: Contenu non autorisé dans le prologue.
[NotAnAgentClass] PLUS PRÉCIS : ** entrée dans ACTIVATE **
[AbstractAgent-6] PLUS PRÉCIS : ** entrée dans ACTIVATE **
[AbstractAgent-6] PLUS PRÉCIS : ** sortie de ACTIVATE **
[NotAnAgentClass] LE PLUS PRÉCIS : lancement java.lang.Object GUI false
[NotAnAgentClass] GRAVE : LAUNCH_AGENT ÉCHEC : 
 ** java.lang.ClassCastException: java.lang.Object cannot be cast to madkit.kernel.AbstractAgent
	at madkit.api.abstractAgent.LaunchAgentClassTest$9.activate(LaunchAgentClassTest.java:123)

[NotAnAgentClass] PLUS PRÉCIS : ** sortie de ACTIVATE **


------------------------ NotAnAgentClass TEST FINISHED ---------------------




------------------------ NoPublicConstructor TEST START ---------------------
[AbstractAgent-13] PLUS PRÉCIS : ** entrée dans ACTIVATE **
[AbstractAgent-13] PLUS PRÉCIS : ** sortie de ACTIVATE **
[NoPublicConstructor] PLUS PRÉCIS : ** entrée dans ACTIVATE **
[NoPublicConstructor] LE PLUS PRÉCIS : lancement madkit.testing.util.agent.NoPublicConstructorAA GUI false
[NoPublicConstructorAA-14] INFOS : launched
[NoPublicConstructor] LE PLUS PRÉCIS : LAUNCH_AGENT  (2147483647)[NoPublicConstructorAA-14]...
[NoPublicConstructor] LE PLUS PRÉCIS : LAUNCH_AGENT [NoPublicConstructorAA-14] (LIVING) OK
[NoPublicConstructor] PLUS PRÉCIS : ** sortie de ACTIVATE **


------------------------ NoPublicConstructor TEST FINISHED ---------------------




------------------------ NotPublic TEST START ---------------------
[NotPublic] PLUS PRÉCIS : ** entrée dans ACTIVATE **
[NotPublic] LE PLUS PRÉCIS : lancement madkit.api.abstractAgent.NotPublicAgent GUI false
[AbstractAgent-21] PLUS PRÉCIS : ** entrée dans ACTIVATE **
[NotPublic] LE PLUS PRÉCIS : LAUNCH_AGENT  (2147483647)NotPublicAgent-22...
[AbstractAgent-21] PLUS PRÉCIS : ** sortie de ACTIVATE **
[NotPublicAgent-22] PLUS PRÉCIS : ** entrée dans ACTIVATE **
[NotPublicAgent-22] PLUS PRÉCIS : ** sortie de ACTIVATE **
[NotPublic] LE PLUS PRÉCIS : LAUNCH_AGENT NotPublicAgent-22 (LIVING) OK
[NotPublic] PLUS PRÉCIS : ** sortie de ACTIVATE **


------------------------ NotPublic TEST FINISHED ---------------------




------------------------ NoDefaultConstructor TEST START ---------------------
[AbstractAgent-29] PLUS PRÉCIS : ** entrée dans ACTIVATE **
[NoDefaultConstructor] PLUS PRÉCIS : ** entrée dans ACTIVATE **
[AbstractAgent-29] PLUS PRÉCIS : ** sortie de ACTIVATE **
[NoDefaultConstructor] LE PLUS PRÉCIS : lancement madkit.testing.util.agent.SelfLaunchAA GUI false
[NoDefaultConstructor] GRAVE : LAUNCH_AGENT ÉCHEC : 
 ** java.lang.NoSuchMethodException: madkit.testing.util.agent.SelfLaunchAA.<init>()
	at madkit.api.abstractAgent.LaunchAgentClassTest$6.activate(LaunchAgentClassTest.java:96)

[NoDefaultConstructor] PLUS PRÉCIS : ** sortie de ACTIVATE **


------------------------ NoDefaultConstructor TEST FINISHED ---------------------




------------------------ launchFailed TEST START ---------------------
[launchFailed] PLUS PRÉCIS : ** entrée dans ACTIVATE **
[AbstractAgent-36] PLUS PRÉCIS : ** entrée dans ACTIVATE **
[launchFailed] LE PLUS PRÉCIS : lancement null GUI false
[AbstractAgent-36] PLUS PRÉCIS : ** sortie de ACTIVATE **
[launchFailed] GRAVE : -*-ACTIVATE BUG*-*
 ** java.lang.NullPointerException
	at madkit.api.abstractAgent.LaunchAgentClassTest$4.activate(LaunchAgentClassTest.java:74)

[launchFailed] PLUS PRÉCIS : ** sortie de ACTIVATE **
[launchFailed] LE PLUS PRÉCIS : ** TERMINATED **
[MadkitKernel-34] GRAVE : LAUNCH_AGENT ÉCHEC : 
 ** madkit.kernel.MadkitWarning: AGENT_CRASH: launchFailed (TERMINATED) l'agent s'est crashé
	at madkit.kernel.MadkitKernel.launchAgent(Unknown Source)
	at madkit.api.abstractAgent.LaunchAgentClassTest.launchFailed(LaunchAgentClassTest.java:71)
	at org.junit.runners.model.FrameworkMethod$1.runReflectiveCall(FrameworkMethod.java:47)
	at org.junit.internal.runners.model.ReflectiveCallable.run(ReflectiveCallable.java:12)
	at org.junit.runners.model.FrameworkMethod.invokeExplosively(FrameworkMethod.java:44)
	at org.junit.internal.runners.statements.InvokeMethod.evaluate(InvokeMethod.java:17)
	at org.junit.rules.TestWatcher$1.evaluate(TestWatcher.java:55)
	at org.junit.rules.RunRules.evaluate(RunRules.java:20)
	at org.junit.runners.ParentRunner.runLeaf(ParentRunner.java:271)
	at org.junit.runners.BlockJUnit4ClassRunner.runChild(BlockJUnit4ClassRunner.java:70)
	at org.junit.runners.BlockJUnit4ClassRunner.runChild(BlockJUnit4ClassRunner.java:50)
	at org.junit.runners.ParentRunner$3.run(ParentRunner.java:238)
	at org.junit.runners.ParentRunner$1.schedule(ParentRunner.java:63)
	at org.junit.runners.ParentRunner.runChildren(ParentRunner.java:236)
	at org.junit.runners.ParentRunner.access$000(ParentRunner.java:53)
	at org.junit.runners.ParentRunner$2.evaluate(ParentRunner.java:229)
	at org.junit.runners.ParentRunner.run(ParentRunner.java:309)
	at junit.framework.JUnit4TestAdapter.run(JUnit4TestAdapter.java:38)
	at org.apache.tools.ant.taskdefs.optional.junit.JUnitTestRunner.run(JUnitTestRunner.java:532)
	at org.apache.tools.ant.taskdefs.optional.junit.JUnitTestRunner.launch(JUnitTestRunner.java:1165)
	at org.apache.tools.ant.taskdefs.optional.junit.JUnitTestRunner.main(JUnitTestRunner.java:1016)



------------------------ launchFailed TEST FINISHED ---------------------




------------------------ launchNotFound TEST START ---------------------
[launchNotFound] PLUS PRÉCIS : ** entrée dans ACTIVATE **
[launchNotFound] LE PLUS PRÉCIS : lancement a GUI false
[AbstractAgent-43] PLUS PRÉCIS : ** entrée dans ACTIVATE **
[AbstractAgent-43] PLUS PRÉCIS : ** sortie de ACTIVATE **
[launchNotFound] GRAVE : LAUNCH_AGENT ÉCHEC : 
 ** java.lang.ClassNotFoundException: a
	at madkit.api.abstractAgent.LaunchAgentClassTest$5.activate(LaunchAgentClassTest.java:87)

[launchNotFound] PLUS PRÉCIS : ** sortie de ACTIVATE **


------------------------ launchNotFound TEST FINISHED ---------------------